Target
Progesterone receptor
Ligand
BDBM50219539
Substrate
Meas. Tech.
ChEMBL_457222 (CHEMBL940823)
IC50
520±n/a nM
Citation
 Higuchi, RIThompson, AWChen, JHCaferro, TRCummings, MLDeckhut, CPAdams, METegley, CMEdwards, JPLópez, FJKallel, EAKaranewsky, DSSchrader, WTMarschke, KBZhi, L Potent, nonsteroidal selective androgen receptor modulators (SARMs) based on 8H-[1,4]oxazino[2,3-f]quinolin-8-ones. Bioorg Med Chem Lett 17:5442-6 (2007)  
Target
Name:
Progesterone receptor
Synonyms:
NR3C3 PGR PRGR_HUMAN | progesterone
Type:
Protein
Mol. Mass.:
98979.52
Organism:
Homo sapiens (Human)
Description:
P06401
Residue:
933
  
Inhibitor
Name:
BDBM50219539
Synonyms:
(R)-3-ethyl-4-(2,2,2-trifluoroethyl)-10-(trifluoromethyl)-3,4-dihydro-2H-[1,4]oxazino[2,3-f]quinolin-8(7H)-one | CHEMBL250897
Type:
Small organic molecule
Emp. Form.:
C16H14F6N2O2
Mol. Mass.:
380.285
SMILES:
CC[C@@H]1COc2c(ccc3[nH]c(=O)cc(c23)C(F)(F)F)N1CC(F)(F)F
: