Target
Androgen receptor
Ligand
BDBM50219558
Substrate
Meas. Tech.
ChEMBL_457219 (CHEMBL940820)
EC50
35±n/a nM
Citation
 Higuchi, RIThompson, AWChen, JHCaferro, TRCummings, MLDeckhut, CPAdams, METegley, CMEdwards, JPLópez, FJKallel, EAKaranewsky, DSSchrader, WTMarschke, KBZhi, L Potent, nonsteroidal selective androgen receptor modulators (SARMs) based on 8H-[1,4]oxazino[2,3-f]quinolin-8-ones. Bioorg Med Chem Lett 17:5442-6 (2007)  
Target
Name:
Androgen receptor
Synonyms:
ANDR_HUMAN Androgen Receptor Androgen receptor/Baculoviral IAP repeat-containing protein 2 Dihydrotestosterone receptor Nuclear receptor subfamily 3 group C member 4
Type:
Receptor
Mol. Mass.:
99185.27
Organism:
Homo sapiens (Human)
Description:
CHO cells were stably transfected with human AR gene.
Residue:
920
  
Inhibitor
Name:
BDBM50219558
Synonyms:
(R)-4-allyl-3-isopropyl-10-(trifluoromethyl)-3,4-dihydro-2H-[1,4]oxazino[2,3-f]quinolin-8(7H)-one | CHEMBL247994
Type:
Small organic molecule
Emp. Form.:
C18H19F3N2O2
Mol. Mass.:
352.3509
SMILES:
CC(C)[C@@H]1COc2c(ccc3[nH]c(=O)cc(c23)C(F)(F)F)N1CC=C
: