Target
Cytochrome P450 3A4
Ligand
BDBM50219566
Substrate
Meas. Tech.
ChEMBL_445840 (CHEMBL896134)
IC50
>500000±n/a nM
Citation
 Wilson, DPWan, ZKXu, WXKirincich, SJFollows, BCJoseph-McCarthy, DForeman, KMoretto, AWu, JZhu, MBinnun, EZhang, YLTam, MErbe, DVTobin, JXu, XLeung, LShilling, ATam, SYMansour, TSLee, J Structure-based optimization of protein tyrosine phosphatase 1B inhibitors: from the active site to the second phosphotyrosine binding site. J Med Chem 50:4681-98 (2007)  
Target
Name:
Cytochrome P450 3A4
Synonyms:
Albendazole monooxygenase CP3A4_HUMAN CYP3A4 CYPIIIA4 Cytochrome P450 3A4 (CYP3A4) Nifedipine oxidase Taurochenodeoxycholate 6-alpha-hydroxylase
Type:
Enzyme
Mol. Mass.:
57349.57
Organism:
Homo sapiens (Human)
Description:
Residue:
503
  
Inhibitor
Name:
BDBM50219566
Synonyms:
4-bromo-3-carboxymethoxy-5-[3-(1-phenylmethanesulfonylpiperidin-4-ylamino)phenyl]thiophene-2-carboxylic acid 5-(3-{[1-(BENZYLSULFONYL)PIPERIDIN-4-YL]AMINO}PHENYL)-4-BROMO-3-(CARBOXYMETHOXY)THIOPHENE-2-CARBOXYLIC ACID | CHEMBL541214
Type:
Small organic molecule
Emp. Form.:
C25H25BrN2O7S2
Mol. Mass.:
609.509
SMILES:
OC(=O)COc1c(Br)c(sc1C(O)=O)-c1cccc(NC2CCN(CC2)S(=O)(=O)Cc2ccccc2)c1
: