Target
Tyrosine-protein phosphatase non-receptor type 2
Ligand
BDBM50219588
Substrate
Meas. Tech.
ChEMBL_445833 (CHEMBL896127)
Ki
2±n/a nM
Citation
 Wilson, DPWan, ZKXu, WXKirincich, SJFollows, BCJoseph-McCarthy, DForeman, KMoretto, AWu, JZhu, MBinnun, EZhang, YLTam, MErbe, DVTobin, JXu, XLeung, LShilling, ATam, SYMansour, TSLee, J Structure-based optimization of protein tyrosine phosphatase 1B inhibitors: from the active site to the second phosphotyrosine binding site. J Med Chem 50:4681-98 (2007)  
Target
Name:
Tyrosine-protein phosphatase non-receptor type 2
Synonyms:
PTN2_HUMAN PTPT T-cell protein-tyrosine phosphatase TCPTP Tyrosine-protein phosphatase non-receptor type 2 (TC-PTP)
Type:
Protein
Mol. Mass.:
48481.80
Organism:
Homo sapiens (Human)
Description:
P17706
Residue:
415
  
Inhibitor
Name:
BDBM50219588
Synonyms:
4-bromo-3-(carboxymethoxy)-5-(3-{[1-({2-[(methylsulfonyl)-amino]benzyl}sulfonyl)piperidin-4-yl]amino}phenyl)thiophene-2-carboxylic acid | CHEMBL395722
Type:
Small organic molecule
Emp. Form.:
C26H28BrN3O9S3
Mol. Mass.:
702.614
SMILES:
CS(=O)(=O)Nc1ccccc1CS(=O)(=O)N1CCC(CC1)Nc1cccc(c1)-c1sc(C(O)=O)c(OCC(O)=O)c1Br
: