Target
D(2) dopamine receptor
Ligand
BDBM50219941
Substrate
Meas. Tech.
ChEMBL_449064 (CHEMBL898269)
IC50
39±n/a nM
Citation
 Agai-Csongor, ENógrádi, KGalambos, JVágó, IBielik, AMagdó, IIgnácz-Szendrei, GKeseru, GMGreiner, ILaszlovszky, ISchmidt, EKiss, BSághy, KLaszy, JGyertyán, IZájer-Balázs, MGémesi, LDomány, G Novel sulfonamides having dual dopamine D2 and D3 receptor affinity show in vivo antipsychotic efficacy with beneficial cognitive and EPS profile. Bioorg Med Chem Lett 17:5340-4 (2007)  
Target
Name:
D(2) dopamine receptor
Synonyms:
DOPAMINE D2 DOPAMINE D2 Short Dopamine D2 receptor Drd2
Type:
G Protein-Coupled Receptor (GPCR)
Mol. Mass.:
50931.60
Organism:
Rattus norvegicus (rat)
Description:
P61169
Residue:
444
  
Inhibitor
Name:
BDBM50219941
Synonyms:
CHEMBL240909 | N-((1r,4r)-4-(2-(4-(3-cyano-5-(trifluoromethyl)phenyl)piperazin-1-yl)ethyl)cyclohexyl)-6-methylpyridine-3-sulfonamide
Type:
Small organic molecule
Emp. Form.:
C26H32F3N5O2S
Mol. Mass.:
535.625
SMILES:
Cc1ccc(cn1)S(=O)(=O)N[C@H]1CC[C@H](CCN2CCN(CC2)c2cc(cc(c2)C(F)(F)F)C#N)CC1
: