Target
Metabotropic glutamate receptor 8
Ligand
BDBM50220009
Substrate
Meas. Tech.
ChEMBL_445957 (CHEMBL896250)
EC50
1720±n/a nM
Citation
 Selvam, CGoudet, COueslati, NPin, JPAcher, FC L-(+)-2-Amino-4-thiophosphonobutyric acid (L-thioAP4), a new potent agonist of group III metabotropic glutamate receptors: increased distal acidity affords enhanced potency. J Med Chem 50:4656-64 (2007)  
Target
Name:
Metabotropic glutamate receptor 8
Synonyms:
GRM8_RAT Grm8 Metabotropic glutamate receptor 8 (mGlu8) glutamate receptor, metabotropic 8 precursor metabotropic glutamate 8
Type:
Enzyme
Mol. Mass.:
101886.18
Organism:
Rattus norvegicus (Rat)
Description:
P70579
Residue:
908
  
Inhibitor
Name:
BDBM50220009
Synonyms:
CHEMBL241972 | L-(+)-2-amino-4-[(hydroxy)phosphinyl]butyric acid
Type:
Small organic molecule
Emp. Form.:
C4H10NO4P
Mol. Mass.:
167.1003
SMILES:
N[C@@H](CCP(O)=O)C(O)=O
: