Target
Serine/threonine-protein kinase Chk1
Ligand
BDBM50220070
Substrate
Meas. Tech.
ChEMBL_446023 (CHEMBL895119)
IC50
3700±n/a nM
Citation
 Conchon, EAnizon, FAboab, BPrudhomme, M Synthesis and biological activities of new checkpoint kinase 1 inhibitors structurally related to granulatimide. J Med Chem 50:4669-80 (2007)  
Target
Name:
Serine/threonine-protein kinase Chk1
Synonyms:
CHEK1 CHK1 checkpoint homolog Checkpoint kinase-1 (CHK1)
Type:
Enzyme Catalytic Domain
Mol. Mass.:
54443.02
Organism:
Homo sapiens (Human)
Description:
gi_166295192
Residue:
476
  
Inhibitor
Name:
BDBM50220070
Synonyms:
7-tert-butylcarbonyloxy-4-hydroxybenzo[a]pyrrolo[3,4-c]carbazole-1,3(2H,8H)-dione | CHEMBL244142
Type:
Small organic molecule
Emp. Form.:
C23H18N2O5
Mol. Mass.:
402.3994
SMILES:
CC(C)(C)C(=O)Oc1ccc(O)c2c3C(=O)NC(=O)c3c3c4ccccc4[nH]c3c12
: