Target
Serine/threonine-protein kinase Chk1
Ligand
BDBM50220065
Substrate
Meas. Tech.
ChEMBL_446023 (CHEMBL895119)
IC50
161±n/a nM
Citation
 Conchon, EAnizon, FAboab, BPrudhomme, M Synthesis and biological activities of new checkpoint kinase 1 inhibitors structurally related to granulatimide. J Med Chem 50:4669-80 (2007)  
Target
Name:
Serine/threonine-protein kinase Chk1
Synonyms:
CHEK1 CHK1 checkpoint homolog Checkpoint kinase-1 (CHK1)
Type:
Enzyme Catalytic Domain
Mol. Mass.:
54443.02
Organism:
Homo sapiens (Human)
Description:
gi_166295192
Residue:
476
  
Inhibitor
Name:
BDBM50220065
Synonyms:
4,7-dihydroxy-11-methylbenzo[a]pyrrolo[3,4-c]carbazole-1,3-(2H,8H)-dione | CHEMBL244141
Type:
Small organic molecule
Emp. Form.:
C19H12N2O4
Mol. Mass.:
332.3096
SMILES:
Cc1ccc2[nH]c3c(c4C(=O)NC(=O)c4c4c(O)ccc(O)c34)c2c1
: