Target
Kinesin-like protein KIF11
Ligand
BDBM50220173
Substrate
Meas. Tech.
ChEMBL_446063 (CHEMBL895158)
IC50
1382±n/a nM
Citation
Target
Name:
Kinesin-like protein KIF11
Synonyms:
EG5 KIF11_HUMAN Kinesin Spindle Protein Eg5 TRIP5 | kinesin spindle protein
Type:
PROTEIN
Mol. Mass.:
119138.97
Organism:
Homo sapiens (Human)
Description:
ChEMBL_1457426
Residue:
1056
  
Inhibitor
Name:
BDBM50220173
Synonyms:
CHEMBL244125 | N-(4'-methyl-4-biphenylyl)urea
Type:
Small organic molecule
Emp. Form.:
C14H14N2O
Mol. Mass.:
226.2738
SMILES:
Cc1ccc(cc1)-c1ccc(NC(N)=O)cc1
: