Target
Kinesin-like protein KIF11
Ligand
BDBM50220186
Substrate
Meas. Tech.
ChEMBL_446063 (CHEMBL895158)
IC50
6000±n/a nM
Citation
Target
Name:
Kinesin-like protein KIF11
Synonyms:
EG5 KIF11_HUMAN Kinesin Spindle Protein Eg5 TRIP5 | kinesin spindle protein
Type:
PROTEIN
Mol. Mass.:
119138.97
Organism:
Homo sapiens (Human)
Description:
ChEMBL_1457426
Residue:
1056
  
Inhibitor
Name:
BDBM50220186
Synonyms:
CHEMBL429816 | N-[4'-(trifluoromethyl)-3-biphenylyl]methanesulfonamide
Type:
Small organic molecule
Emp. Form.:
C14H12F3NO2S
Mol. Mass.:
315.311
SMILES:
CS(=O)(=O)Nc1cccc(c1)-c1ccc(cc1)C(F)(F)F
: