Target
Kinesin-like protein KIF11
Ligand
BDBM50220200
Substrate
Meas. Tech.
ChEMBL_446063 (CHEMBL895158)
IC50
792±n/a nM
Citation
Target
Name:
Kinesin-like protein KIF11
Synonyms:
EG5 KIF11_HUMAN Kinesin Spindle Protein Eg5 TRIP5 | kinesin spindle protein
Type:
PROTEIN
Mol. Mass.:
119138.97
Organism:
Homo sapiens (Human)
Description:
ChEMBL_1457426
Residue:
1056
  
Inhibitor
Name:
BDBM50220200
Synonyms:
CHEMBL430383 | N-[4'-(trifluoromethoxy)-4-biphenylyl]methanesulfonamide
Type:
Small organic molecule
Emp. Form.:
C14H12F3NO3S
Mol. Mass.:
331.31
SMILES:
CS(=O)(=O)Nc1ccc(cc1)-c1ccc(OC(F)(F)F)cc1
: