Target
Glutamate receptor ionotropic, NMDA 2B
Ligand
BDBM50220595
Substrate
Meas. Tech.
ChEMBL_457343 (CHEMBL940934)
Ki
8.5±n/a nM
Citation
 Kawai, MSakurada, IMorita, AIwamuro, YAndo, KOmura, HSakakibara, SMasuda, TKoike, HHonma, THattori, KTakashima, TMizuno, KMizutani, MKawamura, M Structure-activity relationship study of novel NR2B-selective antagonists with arylamides to avoid reactive metabolites formation. Bioorg Med Chem Lett 17:5537-42 (2007)  
Target
Name:
Glutamate receptor ionotropic, NMDA 2B
Synonyms:
GluN2B Grin2b NMDA receptor subunit N2B (GluN2B) NMDE2_RAT | NR2B
Type:
Protein
Mol. Mass.:
166077.66
Organism:
Rattus norvegicus (Rat)
Description:
Q00960
Residue:
1482
  
Inhibitor
Name:
BDBM50220595
Synonyms:
3,5-difluoro-4-hydroxy-N-(((1s,4s)-4-(2-phenoxyethyl)cyclohexyl)methyl)benzamide | CHEMBL249311
Type:
Small organic molecule
Emp. Form.:
C22H25F2NO3
Mol. Mass.:
389.4356
SMILES:
Oc1c(F)cc(cc1F)C(=O)NC[C@@H]1CC[C@H](CCOc2ccccc2)CC1
: