Target
Potassium voltage-gated channel subfamily H member 2
Ligand
BDBM24104
Substrate
Meas. Tech.
ChEMBL_457444 (CHEMBL941016)
IC50
10000±n/a nM
Citation
 Garbaccio, RMTasber, ESNeilson, LAColeman, PJFraley, MEOlson, CBergman, JTorrent, MBuser, CARickert, KWalsh, ESHamilton, KLobell, RBTao, WSouth, VJDiehl, REDavide, JPYan, YKuo, LCLi, CPrueksaritanont, TFernandez-Metzler, CMahan, EASlaughter, DESalata, JJKohl, NEHuber, HEHartman, GD Kinesin spindle protein (KSP) inhibitors. Part 7: Design and synthesis of 3,3-disubstituted dihydropyrazolobenzoxazines as potent inhibitors of the mitotic kinesin KSP. Bioorg Med Chem Lett 17:5671-6 (2007)  
Target
Name:
Potassium voltage-gated channel subfamily H member 2
Synonyms:
1,3-beta-glucan synthase component GLS2 ERG Eag-related protein 1 Ether-a-go-go-related gene (HERG) Ether-a-go-go-related gene potassium channel 1 Ether-a-go-go-related gene potassium channel 1 (hERG1) Ether-a-go-go-related protein 1 H-ERG KCNH2 Potassium voltage-gated channel subfamily H member 2 (hERG) Voltage-gated potassium channel subunit Kv11.1 hERG Potassium Channel 1 | putative potassium channel subunit
Type:
Multi-pass membrane protein
Mol. Mass.:
126672.65
Organism:
Homo sapiens (Human)
Description:
Q12809
Residue:
1159
  
Inhibitor
Name:
BDBM24104
Synonyms:
1-[(5R,6R)-5-[3-(4-acetylpiperazin-1-yl)propyl]-12-fluoro-5-phenyl-8-oxa-2,3-diazatricyclo[7.4.0.0^{2,6}]trideca-1(9),3,10,12-tetraen-4-yl]ethan-1-one dihydropyrazolobenzoxazine, 1
Type:
Small organic molecule
Emp. Form.:
C27H31FN4O3
Mol. Mass.:
478.5584
SMILES:
CC(=O)N1CCN(CCC[C@]2([C@@H]3COc4ccc(F)cc4N3N=C2C(C)=O)c2ccccc2)CC1
: