Target
Kinesin-like protein KIF11
Ligand
BDBM50220969
Substrate
Meas. Tech.
ChEMBL_457441 (CHEMBL941013)
IC50
1±n/a nM
Citation
 Garbaccio, RMTasber, ESNeilson, LAColeman, PJFraley, MEOlson, CBergman, JTorrent, MBuser, CARickert, KWalsh, ESHamilton, KLobell, RBTao, WSouth, VJDiehl, REDavide, JPYan, YKuo, LCLi, CPrueksaritanont, TFernandez-Metzler, CMahan, EASlaughter, DESalata, JJKohl, NEHuber, HEHartman, GD Kinesin spindle protein (KSP) inhibitors. Part 7: Design and synthesis of 3,3-disubstituted dihydropyrazolobenzoxazines as potent inhibitors of the mitotic kinesin KSP. Bioorg Med Chem Lett 17:5671-6 (2007)  
Target
Name:
Kinesin-like protein KIF11
Synonyms:
EG5 KIF11_HUMAN Kinesin Spindle Protein Eg5 TRIP5 | kinesin spindle protein
Type:
PROTEIN
Mol. Mass.:
119138.97
Organism:
Homo sapiens (Human)
Description:
ChEMBL_1457426
Residue:
1056
  
Inhibitor
Name:
BDBM50220969
Synonyms:
1-{(3R,3aR)-3-[3-(4-acetyl-piperazin-1-yl)-propyl]-8-chloro-3-phenyl-3a,4-dihydro-3H-5-oxa-1,9b-diaza-cyclopenta[a]naphthalen-2-yl}-ethanone | CHEMBL250126
Type:
Small organic molecule
Emp. Form.:
C27H31ClN4O3
Mol. Mass.:
495.013
SMILES:
CC(=O)N1CCN(CCC[C@]2([C@@H]3COc4ccc(Cl)cc4N3N=C2C(C)=O)c2ccccc2)CC1
: