Target
Melanocortin receptor 4
Ligand
BDBM50221120
Substrate
Meas. Tech.
ChEMBL_449484 (CHEMBL899759)
Ki
0.940000±n/a nM
Citation
 Jiang, WTucci, FCTran, JAFleck, BAWen, JMarkison, SMarinkovic, DChen, CWArellano, MHoare, SRJohns, MFoster, ACSaunders, JChen, C Pyrrolidinones as potent functional antagonists of the human melanocortin-4 receptor. Bioorg Med Chem Lett 17:5610-3 (2007)  
Target
Name:
Melanocortin receptor 4
Synonyms:
MC4-R MC4R_HUMAN Melanocortin receptor 4 (MC-4) Melanocortin receptor 4 (MC4R)
Type:
Enzyme
Mol. Mass.:
36949.50
Organism:
Homo sapiens (Human)
Description:
P32245
Residue:
332
  
Inhibitor
Name:
BDBM50221120
Synonyms:
1-((R)-1-(4-(2-((S)-1-(2-aminoethylamino)-3-methylbutyl)-6-fluorophenyl)piperazin-1-yl)-3-(2,4-dichlorophenyl)-1-oxopropan-2-yl)pyrrolidin-2-one N-(1-aminoethyl)-N-[(1S)-(2-{4-[(2R)-(2-oxo-1-pyrrolidinyl)-3-(2,4-dichlorophenyl)propionyl]-1-piperazinyl}-3-fluorophenyl)-3-methylbutyl]amine
Type:
Small organic molecule
Emp. Form.:
C30H40Cl2FN5O2
Mol. Mass.:
592.575
SMILES:
CC(C)C[C@H](NCCN)c1cccc(F)c1N1CCN(CC1)C(=O)[C@@H](Cc1ccc(Cl)cc1Cl)N1CCCC1=O
: