Target
Carbonic anhydrase 2
Ligand
BDBM50221256
Substrate
Meas. Tech.
ChEMBL_449548 (CHEMBL899814)
Ki
3830±n/a nM
Citation
 Abdel-Hamid, MKAbdel-Hafez, AAEl-Koussi, NAMahfouz, NMInnocenti, ASupuran, CT Design, synthesis, and docking studies of new 1,3,4-thiadiazole-2-thione derivatives with carbonic anhydrase inhibitory activity. Bioorg Med Chem 15:6975-84 (2007)  
Target
Name:
Carbonic anhydrase 2
Synonyms:
CA-II CAC Carbonate dehydratase II Carbonic anhydrase 2 (CA-II) Carbonic anhydrase C Carbonic anhydrase II (CA-II) Carbonic anhydrase II (hCA II) | Carbonic anhydrase isoenzyme II (hCA II)
Type:
Enzyme
Mol. Mass.:
29250.71
Organism:
Homo sapiens (Human)
Description:
P00918
Residue:
260
  
Inhibitor
Name:
BDBM50221256
Synonyms:
4-(4,5-dihydro-5-thioxo-1,3,4-thiadiazol-2-yl)-1-[alpha-(4-hydroxy phenyl)methylene]semicarbazide | CHEMBL235466
Type:
Small organic molecule
Emp. Form.:
C10H9N5O2S2
Mol. Mass.:
295.341
SMILES:
Oc1ccc(C=NNC(=O)Nc2nnc(S)s2)cc1
: