Target
Carbonic anhydrase 1
Ligand
BDBM50221268
Substrate
Meas. Tech.
ChEMBL_449547 (CHEMBL899813)
Ki
71620±n/a nM
Citation
 Abdel-Hamid, MKAbdel-Hafez, AAEl-Koussi, NAMahfouz, NMInnocenti, ASupuran, CT Design, synthesis, and docking studies of new 1,3,4-thiadiazole-2-thione derivatives with carbonic anhydrase inhibitory activity. Bioorg Med Chem 15:6975-84 (2007)  
Target
Name:
Carbonic anhydrase 1
Synonyms:
CA-I CAB Carbonate dehydratase I Carbonic anhydrase 1 (CA I) Carbonic anhydrase 1 (Recombinant CA I) Carbonic anhydrase B Carbonic anhydrase I (CA I) Carbonic anhydrase I (CAI) Carbonic anhydrase isoenzyme I (hCA I) | hCA
Type:
Enzyme
Mol. Mass.:
28873.37
Organism:
Homo sapiens (Human)
Description:
P00915
Residue:
261
  
Inhibitor
Name:
BDBM50221268
Synonyms:
4-(4,5-dihydro-5-thioxo-1,3,4-thiadiazol-2-yl)-1-[alpha-(3-bromophenyl)methylene]semicarbazide | CHEMBL235473
Type:
Small organic molecule
Emp. Form.:
C10H8BrN5OS2
Mol. Mass.:
358.237
SMILES:
Sc1nnc(NC(=O)NN=Cc2cccc(Br)c2)s1
: