Target
Carbonic anhydrase 9
Ligand
BDBM50221269
Substrate
Meas. Tech.
ChEMBL_449549 (CHEMBL899815)
Ki
8430±n/a nM
Citation
 Abdel-Hamid, MKAbdel-Hafez, AAEl-Koussi, NAMahfouz, NMInnocenti, ASupuran, CT Design, synthesis, and docking studies of new 1,3,4-thiadiazole-2-thione derivatives with carbonic anhydrase inhibitory activity. Bioorg Med Chem 15:6975-84 (2007)  
Target
Name:
Carbonic anhydrase 9
Synonyms:
CA-IX CAH9_HUMAN Carbonic anhydrase 9 (CA IX) Carbonic anhydrase 9 precursor Carbonic anhydrase IX (CAIX) Carbonic anhydrases; II & IX MN RCC-associated antigen G250
Type:
Enzyme
Mol. Mass.:
49669.03
Organism:
Homo sapiens (Human)
Description:
Catalytic domain of human cloned isozyme was used in the assay
Residue:
459
  
Inhibitor
Name:
BDBM50221269
Synonyms:
4-(4,5-dihydro-5-thioxo-1,3,4-thiadiazol-2-yl)-1-[alpha,alpha-diphenyl methylene]semicarbazide | CHEMBL235708
Type:
Small organic molecule
Emp. Form.:
C16H13N5OS2
Mol. Mass.:
355.437
SMILES:
[#16]-c1nnc(-[#7]-[#6](=O)-[#7]\[#7]=[#6](\c2ccccc2)-c2ccccc2)s1
: