Target
Carbonic anhydrase 9
Ligand
BDBM50221265
Substrate
Meas. Tech.
ChEMBL_449549 (CHEMBL899815)
Ki
8550±n/a nM
Citation
 Abdel-Hamid, MKAbdel-Hafez, AAEl-Koussi, NAMahfouz, NMInnocenti, ASupuran, CT Design, synthesis, and docking studies of new 1,3,4-thiadiazole-2-thione derivatives with carbonic anhydrase inhibitory activity. Bioorg Med Chem 15:6975-84 (2007)  
Target
Name:
Carbonic anhydrase 9
Synonyms:
CA-IX CAH9_HUMAN Carbonic anhydrase 9 (CA IX) Carbonic anhydrase 9 precursor Carbonic anhydrase IX (CAIX) Carbonic anhydrases; II & IX MN RCC-associated antigen G250
Type:
Enzyme
Mol. Mass.:
49669.03
Organism:
Homo sapiens (Human)
Description:
Catalytic domain of human cloned isozyme was used in the assay
Residue:
459
  
Inhibitor
Name:
BDBM50221265
Synonyms:
4-(4,5-dihydro-5-thioxo-1,3,4-thiadiazol-2-yl)-1-[alpha-(4-chlorophenyl)-alpha-methyl methylene]semicarbazide | CHEMBL391990
Type:
Small organic molecule
Emp. Form.:
C11H10ClN5OS2
Mol. Mass.:
327.813
SMILES:
CC(=NNC(=O)Nc1nnc(S)s1)c1ccc(Cl)cc1
: