Target
Carbonic anhydrase 1
Ligand
BDBM50221267
Substrate
Meas. Tech.
ChEMBL_449547 (CHEMBL899813)
Ki
9090±n/a nM
Citation
 Abdel-Hamid, MKAbdel-Hafez, AAEl-Koussi, NAMahfouz, NMInnocenti, ASupuran, CT Design, synthesis, and docking studies of new 1,3,4-thiadiazole-2-thione derivatives with carbonic anhydrase inhibitory activity. Bioorg Med Chem 15:6975-84 (2007)  
Target
Name:
Carbonic anhydrase 1
Synonyms:
CA-I CAB Carbonate dehydratase I Carbonic anhydrase 1 (CA I) Carbonic anhydrase 1 (Recombinant CA I) Carbonic anhydrase B Carbonic anhydrase I (CA I) Carbonic anhydrase I (CAI) Carbonic anhydrase isoenzyme I (hCA I) | hCA
Type:
Enzyme
Mol. Mass.:
28873.37
Organism:
Homo sapiens (Human)
Description:
P00915
Residue:
261
  
Inhibitor
Name:
BDBM50221267
Synonyms:
4-(4,5-dihydro-5-thioxo-1,3,4-thiadiazol-2-yl)-1-[alpha-methyl-a-phenyl methylene]semicarbazide | CHEMBL235692
Type:
Small organic molecule
Emp. Form.:
C11H11N5OS2
Mol. Mass.:
293.368
SMILES:
CC(=NNC(=O)Nc1nnc(S)s1)c1ccccc1
: