Target
Beta-secretase 1
Ligand
BDBM16041
Substrate
Meas. Tech.
ChEMBL_449642 (CHEMBL898740)
IC50
9±n/a nM
Citation
 Moore, KPZhu, HRajapakse, HAMcGaughey, GBColussi, DPrice, EASankaranarayanan, SSimon, AJPudvah, NTHochman, JHAllison, TMunshi, SKGraham, SLVacca, JPNantermet, PG Strategies toward improving the brain penetration of macrocyclic tertiary carbinamine BACE-1 inhibitors. Bioorg Med Chem Lett 17:5831-5 (2007)  
Target
Name:
Beta-secretase 1
Synonyms:
ASP2 Aspartyl protease 2 BACE1 Beta-secretase (BACE) Beta-secretase 1 (BACE 1) Beta-secretase 1 (BACE1) Beta-site amyloid precursor protein cleaving enzyme 1 Memapsin-2 beta-Secretase (BACE-1) | beta-Secretase (BACE1)
Type:
Protein
Mol. Mass.:
55755.10
Organism:
Homo sapiens (Human)
Description:
P56817
Residue:
501
  
Inhibitor
Name:
BDBM16041
Synonyms:
3-{5-[(1R)-1-amino-1-methyl-2-phenylethyl]-1,3,4-oxadiazol-2-yl}-N-[(1R)-1-(4-fluorophenyl)ethyl]-5-[methyl(methylsulfonyl)amino]benzamide CHEMBL219601 oxadiazoyl tertiary carbinamine 8
Type:
Small organic molecule
Emp. Form.:
C28H30FN5O4S
Mol. Mass.:
551.632
SMILES:
C[C@@H](NC(=O)c1cc(cc(c1)-c1nnc(o1)[C@](C)(N)Cc1ccccc1)N(C)S(C)(=O)=O)c1ccc(F)cc1
: