Target
D(3) dopamine receptor
Ligand
BDBM50221673
Substrate
Meas. Tech.
ChEMBL_449683 (CHEMBL898787)
Ki
0.31±n/a nM
Citation
 Rodriguez Loaiza, PLöber, SHübner, HGmeiner, P Click chemistry based solid phase supported synthesis of dopaminergic phenylacetylenes. Bioorg Med Chem 15:7248-57 (2007)  
Target
Name:
D(3) dopamine receptor
Synonyms:
DOPAMINE D3 DRD3_HUMAN Dopamine D3 receptor (D3) Dopamine receptor Dopamine receptor D3
Type:
Mol. Mass.:
44243.43
Organism:
Homo sapiens (Human)
Description:
Residue:
400
  
Inhibitor
Name:
BDBM50221673
Synonyms:
CHEMBL394292 | N-{4-[4-(2,3-dichlorophenyl)piperazin-1-yl]butyl}-4-ethynylbenzamide
Type:
Small organic molecule
Emp. Form.:
C23H25Cl2N3O
Mol. Mass.:
430.37
SMILES:
Clc1cccc(N2CCN(CCCCNC(=O)c3ccc(cc3)C#C)CC2)c1Cl
: