Target
Polyunsaturated fatty acid lipoxygenase ALOX12
Ligand
BDBM50222308
Substrate
Meas. Tech.
ChEMBL_457824 (CHEMBL924094)
IC50
620±n/a nM
Citation
 Vasquez-Martinez, YOhri, RVKenyon, VHolman, TRSepúlveda-Boza, S Structure-activity relationship studies of flavonoids as potent inhibitors of human platelet 12-hLO, reticulocyte 15-hLO-1, and prostate epithelial 15-hLO-2. Bioorg Med Chem 15:7408-25 (2007)  
Target
Name:
Polyunsaturated fatty acid lipoxygenase ALOX12
Synonyms:
12-LOX 12LO Arachidonate 12-lipoxygenase LOG12 Platelet 12-lipoxygenase | Platelet-type lipoxygenase 12
Type:
Protein
Mol. Mass.:
75689.18
Organism:
Homo sapiens (Human)
Description:
P18054
Residue:
663
  
Inhibitor
Name:
BDBM50222308
Synonyms:
7,8-dihydroxy-30-trifluoromethylisoflavone | CHEMBL238844
Type:
Small organic molecule
Emp. Form.:
C16H9F3O4
Mol. Mass.:
322.2355
SMILES:
Oc1ccc2c(occ(-c3cccc(c3)C(F)(F)F)c2=O)c1O
: