Target
Polyunsaturated fatty acid lipoxygenase ALOX12
Ligand
BDBM50222282
Substrate
Meas. Tech.
ChEMBL_457824 (CHEMBL924094)
IC50
>100000±n/a nM
Citation
 Vasquez-Martinez, YOhri, RVKenyon, VHolman, TRSepúlveda-Boza, S Structure-activity relationship studies of flavonoids as potent inhibitors of human platelet 12-hLO, reticulocyte 15-hLO-1, and prostate epithelial 15-hLO-2. Bioorg Med Chem 15:7408-25 (2007)  
Target
Name:
Polyunsaturated fatty acid lipoxygenase ALOX12
Synonyms:
12-LOX 12LO Arachidonate 12-lipoxygenase LOG12 Platelet 12-lipoxygenase | Platelet-type lipoxygenase 12
Type:
Protein
Mol. Mass.:
75689.18
Organism:
Homo sapiens (Human)
Description:
P18054
Residue:
663
  
Inhibitor
Name:
BDBM50222282
Synonyms:
3-hydroxy-2-t-butyl-4H-benzopyran-4-one | CHEMBL239023
Type:
Small organic molecule
Emp. Form.:
C13H14O3
Mol. Mass.:
218.2485
SMILES:
CC(C)(C)c1oc2ccccc2c(=O)c1O
: