Target
Polyunsaturated fatty acid lipoxygenase ALOX15
Ligand
BDBM50222277
Substrate
Meas. Tech.
ChEMBL_457825 (CHEMBL924095)
IC50
210±n/a nM
Citation
 Vasquez-Martinez, YOhri, RVKenyon, VHolman, TRSepúlveda-Boza, S Structure-activity relationship studies of flavonoids as potent inhibitors of human platelet 12-hLO, reticulocyte 15-hLO-1, and prostate epithelial 15-hLO-2. Bioorg Med Chem 15:7408-25 (2007)  
Target
Name:
Polyunsaturated fatty acid lipoxygenase ALOX15
Synonyms:
15-Lipoxygenase-1 (15-LOX-1) Arachidonate 15-lipoxygenase LOG15 Reticulocyte 15-lipoxygenase-1 | Sphingosine 1-phosphate receptor 1 (S1P1)
Type:
Protein
Mol. Mass.:
74804.05
Organism:
Homo sapiens (Human)
Description:
Residue:
662
  
Inhibitor
Name:
BDBM50222277
Synonyms:
6,7-dihydroxy-3'-methylisoflavan | CHEMBL239893
Type:
Small organic molecule
Emp. Form.:
C16H16O3
Mol. Mass.:
256.2964
SMILES:
Cc1cccc(c1)C1COc2cc(O)c(O)cc2C1
: