Target
Aldo-keto reductase family 1 member B1
Ligand
BDBM16469
Substrate
Meas. Tech.
ChEMBL_457959 (CHEMBL924228)
IC50
5±n/a nM
Citation
 Ferrari, AMDegliesposti, GSgobba, MRastelli, G Validation of an automated procedure for the prediction of relative free energies of binding on a set of aldose reductase inhibitors. Bioorg Med Chem 15:7865-77 (2007)  
Target
Name:
Aldo-keto reductase family 1 member B1
Synonyms:
AKR1B1 ALDR_HUMAN AR Aldose Reductase (ALR2) Aldose reductase (AR)
Type:
Protein
Mol. Mass.:
35855.50
Organism:
Homo sapiens (Human)
Description:
P15121. 4LAU; 2IKI; 4LB4; 2FZD; 2FZ8; 1US0
Residue:
316
  
Inhibitor
Name:
BDBM16469
Synonyms:
2-{3-[(4,5,7-trifluoro-1,3-benzothiazol-2-yl)methyl]-1H-indol-1-yl}acetic acid IDD-676 Lidorestat | {3-[(4,5,7-trifluoro-1,3-benzothiazol-2-yl)methyl]-1H-indol-1-yl}acetic acid
Type:
Small organic molecule
Emp. Form.:
C18H11F3N2O2S
Mol. Mass.:
376.352
SMILES:
OC(=O)Cn1cc(Cc2nc3c(F)c(F)cc(F)c3s2)c2ccccc12
: