Target
Sodium channel protein type 9 subunit alpha
Ligand
BDBM50216671
Substrate
Meas. Tech.
ChEMBL_458097 (CHEMBL924359)
IC50
35±n/a nM
Citation
 Hoyt, SBLondon, COk, HGonzalez, EDuffy, JLAbbadie, CDean, BFelix, JPGarcia, MLJochnowitz, NKaranam, BVLi, XLyons, KAMcGowan, EMacintyre, DEMartin, WJPriest, BTSmith, MMTschirret-Guth, RWarren, VAWilliams, BSKaczorowski, GJParsons, WH Benzazepinone Nav1.7 blockers: potential treatments for neuropathic pain. Bioorg Med Chem Lett 17:6172-7 (2007)  
Target
Name:
Sodium channel protein type 9 subunit alpha
Synonyms:
NENA Peripheral sodium channel 1 SCN9A_HUMAN Voltage-gated sodium channel subunit Nav1.7 hNE-Na
Type:
Protein
Mol. Mass.:
226375.97
Organism:
Homo sapiens (Human)
Description:
Q15858
Residue:
1988
  
Inhibitor
Name:
BDBM50216671
Synonyms:
CHEMBL247828 | tert-butyl (R)-1-((R)-1-isopropyl-2-oxo-2,3,4,5-tetrahydro-1H-benzo[b]azepin-3-ylamino)-1-oxo-3-(2-(trifluoromethoxy)phenyl)propan-2-ylcarbamate
Type:
Small organic molecule
Emp. Form.:
C28H34F3N3O5
Mol. Mass.:
549.5819
SMILES:
CC(C)N1c2ccccc2CC[C@@H](NC(=O)[C@@H](Cc2ccccc2OC(F)(F)F)NC(=O)OC(C)(C)C)C1=O
: