Target
Sodium channel protein type 9 subunit alpha
Ligand
BDBM50223145
Substrate
Meas. Tech.
ChEMBL_458097 (CHEMBL924359)
IC50
107±n/a nM
Citation
 Hoyt, SBLondon, COk, HGonzalez, EDuffy, JLAbbadie, CDean, BFelix, JPGarcia, MLJochnowitz, NKaranam, BVLi, XLyons, KAMcGowan, EMacintyre, DEMartin, WJPriest, BTSmith, MMTschirret-Guth, RWarren, VAWilliams, BSKaczorowski, GJParsons, WH Benzazepinone Nav1.7 blockers: potential treatments for neuropathic pain. Bioorg Med Chem Lett 17:6172-7 (2007)  
Target
Name:
Sodium channel protein type 9 subunit alpha
Synonyms:
NENA Peripheral sodium channel 1 SCN9A_HUMAN Voltage-gated sodium channel subunit Nav1.7 hNE-Na
Type:
Protein
Mol. Mass.:
226375.97
Organism:
Homo sapiens (Human)
Description:
Q15858
Residue:
1988
  
Inhibitor
Name:
BDBM50223145
Synonyms:
CHEMBL398242 | N-((R)-1-((R)-7-chloro-1-isopropyl-2-oxo-2,3,4,5-tetrahydro-1H-benzo[b]azepin-3-ylamino)-3-(2,6-dichlorophenyl)-1-oxopropan-2-yl)-4-fluoro-2-(trifluoromethyl)benzamide
Type:
Small organic molecule
Emp. Form.:
C30H26Cl3F4N3O3
Mol. Mass.:
658.898
SMILES:
CC(C)N1c2ccc(Cl)cc2CC[C@@H](NC(=O)[C@@H](Cc2c(Cl)cccc2Cl)NC(=O)c2ccc(F)cc2C(F)(F)F)C1=O
: