Target
Bifunctional epoxide hydrolase 2
Ligand
BDBM50223398
Substrate
Meas. Tech.
ChEMBL_446700 (CHEMBL896996)
IC50
1.8±n/a nM
Citation
 Kim, IHTsai, HJNishi, KKasagami, TMorisseau, CHammock, BD 1,3-disubstituted ureas functionalized with ether groups are potent inhibitors of the soluble epoxide hydrolase with improved pharmacokinetic properties. J Med Chem 50:5217-26 (2007)  
Target
Name:
Bifunctional epoxide hydrolase 2
Synonyms:
Cytosolic epoxide hydrolase 2 EPHX2 HYES_HUMAN Soluble epoxide hydrolase (sEH) | epoxide hydrolase 2, cytoplasmic
Type:
Enzyme
Mol. Mass.:
62613.07
Organism:
Homo sapiens (Human)
Description:
P34913
Residue:
555
  
Inhibitor
Name:
BDBM50223398
Synonyms:
1-Adamantan-1-yl-3-{4-[2-(2-ethoxy-ethoxy)-ethoxy]-phenyl}-urea CHEMBL438867
Type:
Small organic molecule
Emp. Form.:
C23H34N2O4
Mol. Mass.:
402.5271
SMILES:
CCOCCOCCOc1ccc(NC(=O)NC23CC4CC(CC(C4)C2)C3)cc1
: