Target
Serine/threonine-protein kinase Chk1
Ligand
BDBM50223477
Substrate
Meas. Tech.
ChEMBL_458175 (CHEMBL924433)
IC50
44±n/a nM
Citation
 Garbaccio, RMHuang, STasber, ESFraley, MEYan, YMunshi, SIkuta, MKuo, LKreatsoulas, CStirdivant, SDrakas, BRickert, KWalsh, ESHamilton, KABuser, CAHardwick, JMao, XBeck, SCAbrams, MTTao, WLobell, RSepp-Lorenzino, LHartman, GD Synthesis and evaluation of substituted benzoisoquinolinones as potent inhibitors of Chk1 kinase. Bioorg Med Chem Lett 17:6280-5 (2007)  
Target
Name:
Serine/threonine-protein kinase Chk1
Synonyms:
CHEK1 CHK1 checkpoint homolog Checkpoint kinase-1 (CHK1)
Type:
Enzyme Catalytic Domain
Mol. Mass.:
54443.02
Organism:
Homo sapiens (Human)
Description:
gi_166295192
Residue:
476
  
Inhibitor
Name:
BDBM50223477
Synonyms:
9-bromo-6-(2-(methylamino)ethyl)benzo[h]isoquinolin-1(2H)-one | CHEMBL399966
Type:
Small organic molecule
Emp. Form.:
C16H15BrN2O
Mol. Mass.:
331.207
SMILES:
CNCCc1cc2cc[nH]c(=O)c2c2cc(Br)ccc12
: