Target
Serine/threonine-protein kinase Chk1
Ligand
BDBM50223462
Substrate
Meas. Tech.
ChEMBL_458175 (CHEMBL924433)
IC50
2.3±n/a nM
Citation
 Garbaccio, RMHuang, STasber, ESFraley, MEYan, YMunshi, SIkuta, MKuo, LKreatsoulas, CStirdivant, SDrakas, BRickert, KWalsh, ESHamilton, KABuser, CAHardwick, JMao, XBeck, SCAbrams, MTTao, WLobell, RSepp-Lorenzino, LHartman, GD Synthesis and evaluation of substituted benzoisoquinolinones as potent inhibitors of Chk1 kinase. Bioorg Med Chem Lett 17:6280-5 (2007)  
Target
Name:
Serine/threonine-protein kinase Chk1
Synonyms:
CHEK1 CHK1 checkpoint homolog Checkpoint kinase-1 (CHK1)
Type:
Enzyme Catalytic Domain
Mol. Mass.:
54443.02
Organism:
Homo sapiens (Human)
Description:
gi_166295192
Residue:
476
  
Inhibitor
Name:
BDBM50223462
Synonyms:
6-(3-aminopropyl)-4-bromo-9-(1H-pyrazol-4-yl)benzo[h]isoquinolin-1(2H)-one | CHEMBL249044
Type:
Small organic molecule
Emp. Form.:
C19H17BrN4O
Mol. Mass.:
397.268
SMILES:
NCCCc1cc2c(Br)c[nH]c(=O)c2c2cc(ccc12)-c1cn[nH]c1
: