Target
Serine/threonine-protein kinase Chk1
Ligand
BDBM50223465
Substrate
Meas. Tech.
ChEMBL_458175 (CHEMBL924433)
IC50
420±n/a nM
Citation
 Garbaccio, RMHuang, STasber, ESFraley, MEYan, YMunshi, SIkuta, MKuo, LKreatsoulas, CStirdivant, SDrakas, BRickert, KWalsh, ESHamilton, KABuser, CAHardwick, JMao, XBeck, SCAbrams, MTTao, WLobell, RSepp-Lorenzino, LHartman, GD Synthesis and evaluation of substituted benzoisoquinolinones as potent inhibitors of Chk1 kinase. Bioorg Med Chem Lett 17:6280-5 (2007)  
Target
Name:
Serine/threonine-protein kinase Chk1
Synonyms:
CHEK1 CHK1 checkpoint homolog Checkpoint kinase-1 (CHK1)
Type:
Enzyme Catalytic Domain
Mol. Mass.:
54443.02
Organism:
Homo sapiens (Human)
Description:
gi_166295192
Residue:
476
  
Inhibitor
Name:
BDBM50223465
Synonyms:
3-(9-bromo-1-oxo-1,2-dihydrobenzo[h]isoquinolin-6-yl)propanenitrile | CHEMBL249401
Type:
Small organic molecule
Emp. Form.:
C16H11BrN2O
Mol. Mass.:
327.175
SMILES:
Brc1ccc2c(CCC#N)cc3cc[nH]c(=O)c3c2c1
: