Target
Alpha-1D adrenergic receptor
Ligand
BDBM50213513
Substrate
Meas. Tech.
ChEMBL_450224 (CHEMBL900499)
Ki
34±n/a nM
Citation
 Chiu, GLi, SCai, HConnolly, PJPeng, SStauber, KPulito, VLiu, JMiddleton, SA Aminocyclohexylsulfonamides: discovery of metabolically stable alpha(1a/1d)-selective adrenergic receptor antagonists for the treatment of benign prostatic hyperplasia/lower urinary tract symptoms (BPH/LUTS). Bioorg Med Chem Lett 17:6123-8 (2007)  
Target
Name:
Alpha-1D adrenergic receptor
Synonyms:
ADA1D_HUMAN ADRA1D Adrenergic receptor alpha Alpha 1D-adrenoreceptor Alpha-1D adrenoceptor adrenergic Alpha1D
Type:
Enzyme Catalytic Domain
Mol. Mass.:
60485.82
Organism:
Homo sapiens (Human)
Description:
adrenergic Alpha1D ADRA1D HUMAN::P25100
Residue:
572
  
Inhibitor
Name:
BDBM50213513
Synonyms:
CHEMBL228278 | N-((1r,4r)-4-(4-(2-cyclopropoxyphenyl)piperidin-1-yl)cyclohexyl)-3,4-dimethoxybenzenesulfonamide
Type:
Small organic molecule
Emp. Form.:
C28H38N2O5S
Mol. Mass.:
514.677
SMILES:
COc1ccc(cc1OC)S(=O)(=O)N[C@H]1CC[C@@H](CC1)N1CCC(CC1)c1ccccc1OC1CC1
: