Target
Alpha-1D adrenergic receptor
Ligand
BDBM50213537
Substrate
Meas. Tech.
ChEMBL_450224 (CHEMBL900499)
Ki
23±n/a nM
Citation
 Chiu, GLi, SCai, HConnolly, PJPeng, SStauber, KPulito, VLiu, JMiddleton, SA Aminocyclohexylsulfonamides: discovery of metabolically stable alpha(1a/1d)-selective adrenergic receptor antagonists for the treatment of benign prostatic hyperplasia/lower urinary tract symptoms (BPH/LUTS). Bioorg Med Chem Lett 17:6123-8 (2007)  
Target
Name:
Alpha-1D adrenergic receptor
Synonyms:
ADA1D_HUMAN ADRA1D Adrenergic receptor alpha Alpha 1D-adrenoreceptor Alpha-1D adrenoceptor adrenergic Alpha1D
Type:
Enzyme Catalytic Domain
Mol. Mass.:
60485.82
Organism:
Homo sapiens (Human)
Description:
adrenergic Alpha1D ADRA1D HUMAN::P25100
Residue:
572
  
Inhibitor
Name:
BDBM50213537
Synonyms:
3,4-dimethoxy-N-((1r,4r)-4-(4-(2-(2,2,2-trifluoroethoxy)phenyl)piperidin-1-yl)cyclohexyl)benzenesulfonamide | CHEMBL228389
Type:
Small organic molecule
Emp. Form.:
C27H35F3N2O5S
Mol. Mass.:
556.637
SMILES:
COc1ccc(cc1OC)S(=O)(=O)N[C@H]1CC[C@@H](CC1)N1CCC(CC1)c1ccccc1OCC(F)(F)F
: