Target
Integrin alpha-V/beta-3
Ligand
BDBM50125289
Substrate
Meas. Tech.
ChEMBL_458247 (CHEMBL925582)
Ki
2.5±n/a nM
Citation
 Urbahns, KHärter, MAlbers, MSchmidt, DStelte-Ludwig, BBrüggemeier, UVaupel, AKeldenich, JLustig, KTsujishita, HGerdes, C Biphenyls as potent vitronectin receptor antagonists. Part 3: Squaric acid amides. Bioorg Med Chem Lett 17:6151-4 (2007)  
Target
Name:
Integrin alpha-V/beta-3
Synonyms:
ITGAV/ITGB3 | Integrin beta-3/Vitronectin receptor alpha
Type:
Enzyme
Mol. Mass.:
Description:
Components:
This complex has 2 components.
Component 1
Name:
Integrin alpha-V
Synonyms:
ITAV_HUMAN Integrin alpha-V/alpha-5 VNRA Vitronectin receptor | Vitronectin receptor subunit alpha
Type:
PROTEIN
Mol. Mass.:
116024.92
Organism:
Homo sapiens (Human)
Description:
ChEMBL_582336
Residue:
1048
  
Component 2
Name:
Integrin beta-3
Synonyms:
CD_antigen=CD61 GPIIIa ITGB3 Platelet membrane glycoprotein IIIa
Type:
Protein
Mol. Mass.:
87038.91
Organism:
Homo sapiens (Human)
Description:
P05106
Residue:
788
  
Inhibitor
Name:
BDBM50125289
Synonyms:
(S)-3-[3'-(3-Cyclopropyl-ureido)-biphenyl-4-yl]-2-(2,4,6-trimethyl-benzenesulfonylamino)-propionic acid | CHEMBL10811
Type:
Small organic molecule
Emp. Form.:
C28H31N3O5S
Mol. Mass.:
521.628
SMILES:
Cc1cc(C)c(c(C)c1)S(=O)(=O)N[C@@H](Cc1ccc(cc1)-c1cccc(NC(=O)NC2CC2)c1)C(O)=O
: