Target
Histamine H3 receptor
Ligand
BDBM50224190
Substrate
Meas. Tech.
ChEMBL_450592 (CHEMBL900878)
EC50
5.75±n/a nM
Citation
 Altenbach, RJLiu, HBanfor, PNBrowman, KEFox, GBFryer, RMKomater, VAKrueger, KMMarsh, KMiller, TRPan, JBPan, LSun, MThiffault, CWetter, JZhao, CZhou, DEsbenshade, TAHancock, AACowart, MD Synthesis, potency, and in vivo profiles of quinoline containing histamine H3 receptor inverse agonists. J Med Chem 50:5439-48 (2007)  
Target
Name:
Histamine H3 receptor
Synonyms:
HH3R Hrh3
Type:
G Protein-Coupled Receptor (GPCR)
Mol. Mass.:
48607.98
Organism:
Rattus norvegicus (rat)
Description:
Residue:
445
  
Inhibitor
Name:
BDBM50224190
Synonyms:
(R)-2-(1,3-dimethyl-1H-pyrazol-4-yl)-6-(2-(2-methylpyrrolidin-1-yl)ethyl)quinoline | CHEMBL442242
Type:
Small organic molecule
Emp. Form.:
C21H26N4
Mol. Mass.:
334.4579
SMILES:
C[C@@H]1CCCN1CCc1ccc2nc(ccc2c1)-c1cn(C)nc1C
: