Target
11-beta-hydroxysteroid dehydrogenase 1
Ligand
BDBM50224206
Substrate
Meas. Tech.
ChEMBL_450657 (CHEMBL900940)
IC50
310±n/a nM
Citation
 Yuan, CSt Jean, DJLiu, QCai, LLi, AHan, NMoniz, GAskew, BHungate, RWJohansson, LTedenborg, LPyring, DWilliams, MHale, CChen, MCupples, RZhang, JJordan, SBartberger, MDSun, YEmery, MWang, MFotsch, C The discovery of 2-anilinothiazolones as 11beta-HSD1 inhibitors. Bioorg Med Chem Lett 17:6056-61 (2007)  
Target
Name:
11-beta-hydroxysteroid dehydrogenase 1
Synonyms:
11-DH 11-beta-Hydroxysteroid Dehydrogenase 1 (11-beta-HSD1) 11-beta-hydroxysteroid dehydrogenase 1 (11HSD1) Corticosteroid 11-beta-dehydrogenase isozyme 1 (11-beta-HSD-1) Corticosteroid 11-beta-dehydrogenase isozyme 1 (11beta-HSD1) HSD11 HSD11L | SDR26C1
Type:
Enzyme
Mol. Mass.:
32409.16
Organism:
Homo sapiens (Human)
Description:
P28845
Residue:
292
  
Inhibitor
Name:
BDBM50224206
Synonyms:
5-isopropyl-2-(phenylamino)thiazol-4(5H)-one | CHEMBL239420
Type:
Small organic molecule
Emp. Form.:
C12H14N2OS
Mol. Mass.:
234.317
SMILES:
CC(C)c1sc(Nc2ccccc2)nc1O
: