Target
Urotensin-2 receptor
Ligand
BDBM50224715
Substrate
Meas. Tech.
ChEMBL_450868 (CHEMBL899954)
IC50
10±n/a nM
Citation
 Luci, DKGhosh, SSmith, CEQi, JWang, YHaertlein, BParry, TJLi, JAlmond, HRMinor, LKDamiano, BPKinney, WAMaryanoff, BELawson, EC Phenylpiperidine-benzoxazinones as urotensin-II receptor antagonists: synthesis, SAR, and in vivo assessment. Bioorg Med Chem Lett 17:6489-92 (2007)  
Target
Name:
Urotensin-2 receptor
Synonyms:
G-protein coupled receptor 14 Gpr14 UR-II-R Urotensin-II | Uts2r
Type:
Enzyme Catalytic Domain
Mol. Mass.:
42725.34
Organism:
RAT
Description:
Urotensin-II UTS2R RAT::P49684
Residue:
386
  
Inhibitor
Name:
BDBM50224715
Synonyms:
CHEMBL396443 | tert-butyl 4-(2-(5-chloro-2-(1-(2-(3-oxo-2,3-dihydrobenzo[b][1,4]oxazin-4-yl)ethyl)piperidin-4-yl)benzamido)ethyl)piperazine-1-carboxylate
Type:
Small organic molecule
Emp. Form.:
C33H44ClN5O5
Mol. Mass.:
626.186
SMILES:
CC(C)(C)OC(=O)N1CCN(CCNC(=O)c2cc(Cl)ccc2C2CCN(CCN3C(=O)COc4ccccc34)CC2)CC1
: