Target
Dipeptidyl peptidase 4
Ligand
BDBM50225049
Substrate
Meas. Tech.
ChEMBL_450927 (CHEMBL900014)
Ki
14±n/a nM
Citation
 Simpkins, LMBolton, SPi, ZSutton, JCKwon, CZhao, GMagnin, DRAugeri, DJGungor, TRotella, DPSun, ZLiu, YSlusarchyk, WSMarcinkeviciene, JRobertson, JGWang, ARobl, JAAtwal, KSZahler, RLParker, RAKirby, MSHamann, LG Potent non-nitrile dipeptidic dipeptidyl peptidase IV inhibitors. Bioorg Med Chem Lett 17:6476-80 (2007)  
Target
Name:
Dipeptidyl peptidase 4
Synonyms:
ADABP Adenosine deaminase complexing protein 2 CD_antigen=CD26 DPP4 DPPIV Dipeptidyl peptidase 4 (DPP IV) Dipeptidyl peptidase 4 (DPP4) Dipeptidyl peptidase 4 membrane form Dipeptidyl peptidase IV Dipeptidyl peptidase IV (DDP-IV) Dipeptidyl peptidase IV membrane form Dipeptidyl peptidase-IV (DPP-4) T-cell activation antigen CD26 | TP103
Type:
Enzyme
Mol. Mass.:
88271.01
Organism:
Homo sapiens (Human)
Description:
P27487
Residue:
766
  
Inhibitor
Name:
BDBM50225049
Synonyms:
2-(S)-amino-1-(1S,5R)-2-aza-bicyclo[3.1.0]hex-2-yl-2-(3,5-dihydroxy-adamantan-1-yl)-ethanone | CHEMBL238026
Type:
Small organic molecule
Emp. Form.:
C17H26N2O3
Mol. Mass.:
306.3999
SMILES:
N[C@H](C(=O)N1CC[C@@H]2C[C@H]12)C12CC3CC(O)(CC(O)(C3)C1)C2
: