Target
Beta-lactamase TEM
Ligand
BDBM50225381
Substrate
Meas. Tech.
ChEMBL_451362 (CHEMBL901565)
Ki
28±n/a nM
Citation
 Venturelli, ATondi, DCancian, LMorandi, FCannazza, GSegatore, BPrati, FAmicosante, GShoichet, BKCosti, MP Optimizing cell permeation of an antibiotic resistance inhibitor for improved efficacy. J Med Chem 50:5644-54 (2007)  
Target
Name:
Beta-lactamase TEM
Synonyms:
BLAT_ECOLX Beta-lactamase (TEM-1) Beta-lactamase TEM-1 Beta-lactamase TEM1D Beta-lactamase TEM1F TEM extended-spectrum beta-lactamase bla
Type:
Enzyme
Mol. Mass.:
31512.33
Organism:
Escherichia coli
Description:
P62593
Residue:
286
  
Inhibitor
Name:
BDBM50225381
Synonyms:
CHEMBL235293 | pinacol5-{[4-(1-hydroxy-2,2,2-trifluoro-1-trifluoromethylethyl)-phenylamino]methyl}benzo[b]thiophen-2-ylboronate
Type:
Small organic molecule
Emp. Form.:
C18H14BF6NO3S
Mol. Mass.:
449.175
SMILES:
OB(O)c1cc2cc(CNc3ccc(cc3)C(O)(C(F)(F)F)C(F)(F)F)ccc2s1
: