Target
Metabotropic glutamate receptor 2
Ligand
BDBM50225822
Substrate
Meas. Tech.
ChEMBL_451634 (CHEMBL901846)
IC50
2900±n/a nM
Citation
 Woltering, TJAdam, GAlanine, AWichmann, JKnoflach, FMutel, VGatti, S Synthesis and characterization of 8-ethynyl-1,3-dihydro-benzo[b][1,4]diazepin-2-one derivatives: new potent non-competitive metabotropic glutamate receptor 2/3 antagonists. Part 1. Bioorg Med Chem Lett 17:6811-5 (2007)  
Target
Name:
Metabotropic glutamate receptor 2
Synonyms:
GPRC1B GRM2_HUMAN Metabotropic glutamate receptor mGlu2 | metabotropic glutamate 2
Type:
Enzyme
Mol. Mass.:
95584.88
Organism:
Homo sapiens (Human)
Description:
Q14416
Residue:
872
  
Inhibitor
Name:
BDBM50225822
Synonyms:
(E)-3-(7-methyl-4-oxo-4,5-dihydro-3H-benzo[b][1,4]diazepin-2-yl)benzonitrile | CHEMBL235600
Type:
Small organic molecule
Emp. Form.:
C17H13N3O
Mol. Mass.:
275.3046
SMILES:
Cc1ccc2N=C(CC(=O)Nc2c1)c1cccc(c1)C#N
: