Target
Dipeptidyl peptidase 4
Ligand
BDBM50226086
Substrate
Meas. Tech.
ChEMBL_458753 (CHEMBL943037)
IC50
2.4±n/a nM
Citation
 Corbett, JWDirico, KSong, WBoscoe, BPDoran, SDBoyer, DQiu, XAmmirati, MVanvolkenburg, MAMcPherson, RKParker, JCCox, ED Design and synthesis of potent amido- and benzyl-substituted cis-3-amino-4-(2-cyanopyrrolidide)pyrrolidinyl DPP-IV inhibitors. Bioorg Med Chem Lett 17:6707-13 (2007)  
Target
Name:
Dipeptidyl peptidase 4
Synonyms:
ADABP Adenosine deaminase complexing protein 2 CD_antigen=CD26 DPP4 DPPIV Dipeptidyl peptidase 4 (DPP IV) Dipeptidyl peptidase 4 (DPP4) Dipeptidyl peptidase 4 membrane form Dipeptidyl peptidase IV Dipeptidyl peptidase IV (DDP-IV) Dipeptidyl peptidase IV membrane form Dipeptidyl peptidase-IV (DPP-4) T-cell activation antigen CD26 | TP103
Type:
Enzyme
Mol. Mass.:
88271.01
Organism:
Homo sapiens (Human)
Description:
P27487
Residue:
766
  
Inhibitor
Name:
BDBM50226086
Synonyms:
(S)-1-((3R,4R)-1-(4-cyanobenzyl)-3-aminopyrrolidine-4-carbonyl)pyrrolidine-2-carbonitrile | CHEMBL248599
Type:
Small organic molecule
Emp. Form.:
C18H21N5O
Mol. Mass.:
323.3922
SMILES:
N[C@H]1CN(Cc2ccc(cc2)C#N)C[C@H]1C(=O)N1CCC[C@H]1C#N
: