Target
Beta-secretase 1
Ligand
BDBM50226448
Substrate
Meas. Tech.
ChEMBL_451978 (CHEMBL901136)
IC50
470±n/a nM
Citation
 Edwards, PDAlbert, JSSylvester, MAharony, DAndisik, DCallaghan, OCampbell, JBCarr, RAChessari, GCongreve, MFrederickson, MFolmer, RHGeschwindner, SKoether, GKolmodin, KKrumrine, JMauger, RCMurray, CWOlsson, LLPatel, SSpear, NTian, G Application of fragment-based lead generation to the discovery of novel, cyclic amidine beta-secretase inhibitors with nanomolar potency, cellular activity, and high ligand efficiency. J Med Chem 50:5912-25 (2007)  
Target
Name:
Beta-secretase 1
Synonyms:
ASP2 Aspartyl protease 2 BACE1 Beta-secretase (BACE) Beta-secretase 1 (BACE 1) Beta-secretase 1 (BACE1) Beta-site amyloid precursor protein cleaving enzyme 1 Memapsin-2 beta-Secretase (BACE-1) | beta-Secretase (BACE1)
Type:
Protein
Mol. Mass.:
55755.10
Organism:
Homo sapiens (Human)
Description:
P56817
Residue:
501
  
Inhibitor
Name:
BDBM50226448
Synonyms:
(6R)-2-amino-6-[2-(3'-methoxybiphenyl-3-yl)ethyl]-3,6-dimethyl-5,6-dihydropyrimidin-4(3H)-one CHEMBL239857
Type:
Small organic molecule
Emp. Form.:
C21H25N3O2
Mol. Mass.:
351.4421
SMILES:
COc1cccc(c1)-c1cccc(CC[C@]2(C)CC(=O)N(C)C(N)=N2)c1
: