Target
Melanocortin receptor 4
Ligand
BDBM50221120
Substrate
Meas. Tech.
ChEMBL_452227 (CHEMBL901379)
Ki
0.710000±n/a nM
Citation
 Tran, JAJiang, WTucci, FCFleck, BAWen, JSai, YMadan, AChen, TKMarkison, SFoster, ACHoare, SRMarks, DHarman, JChen, CWArellano, MMarinkovic, DBozigian, HSaunders, JChen, C Design, synthesis, in vitro, and in vivo characterization of phenylpiperazines and pyridinylpiperazines as potent and selective antagonists of the melanocortin-4 receptor. J Med Chem 50:6356-66 (2007)  
Target
Name:
Melanocortin receptor 4
Synonyms:
MC4-R Mc4r
Type:
PROTEIN
Mol. Mass.:
36964.43
Organism:
Mus musculus
Description:
ChEMBL_1498850
Residue:
332
  
Inhibitor
Name:
BDBM50221120
Synonyms:
1-((R)-1-(4-(2-((S)-1-(2-aminoethylamino)-3-methylbutyl)-6-fluorophenyl)piperazin-1-yl)-3-(2,4-dichlorophenyl)-1-oxopropan-2-yl)pyrrolidin-2-one N-(1-aminoethyl)-N-[(1S)-(2-{4-[(2R)-(2-oxo-1-pyrrolidinyl)-3-(2,4-dichlorophenyl)propionyl]-1-piperazinyl}-3-fluorophenyl)-3-methylbutyl]amine
Type:
Small organic molecule
Emp. Form.:
C30H40Cl2FN5O2
Mol. Mass.:
592.575
SMILES:
CC(C)C[C@H](NCCN)c1cccc(F)c1N1CCN(CC1)C(=O)[C@@H](Cc1ccc(Cl)cc1Cl)N1CCCC1=O
: