Target
Melanocortin receptor 4
Ligand
BDBM50221119
Substrate
Meas. Tech.
ChEMBL_452172 (CHEMBL900284)
Ki
0.600000±n/a nM
Citation
 Tran, JAJiang, WTucci, FCFleck, BAWen, JSai, YMadan, AChen, TKMarkison, SFoster, ACHoare, SRMarks, DHarman, JChen, CWArellano, MMarinkovic, DBozigian, HSaunders, JChen, C Design, synthesis, in vitro, and in vivo characterization of phenylpiperazines and pyridinylpiperazines as potent and selective antagonists of the melanocortin-4 receptor. J Med Chem 50:6356-66 (2007)  
Target
Name:
Melanocortin receptor 4
Synonyms:
MC4-R MC4R_HUMAN Melanocortin receptor 4 (MC-4) Melanocortin receptor 4 (MC4R)
Type:
Enzyme
Mol. Mass.:
36949.50
Organism:
Homo sapiens (Human)
Description:
P32245
Residue:
332
  
Inhibitor
Name:
BDBM50221119
Synonyms:
CHEMBL236521 N-[(1S)-1-[2-[4-[(2R)-3-(2,4-dichlorophenyl)-2-(2-oxo-1-pyrrolidinyl)propionyl]-1-piperazinyl]-5-methylphenyl]-3-methylbutyl]-3-(dimethylamino)propanamide
Type:
Small organic molecule
Emp. Form.:
C34H47Cl2N5O3
Mol. Mass.:
644.675
SMILES:
CC(C)C[C@H](NC(=O)CCN(C)C)c1cc(C)ccc1N1CCN(CC1)C(=O)[C@@H](Cc1ccc(Cl)cc1Cl)N1CCCC1=O
: