Target
Oxysterols receptor LXR-alpha
Ligand
BDBM50227155
Substrate
Meas. Tech.
ChEMBL_461473 (CHEMBL927484)
IC50
528±n/a nM
Citation
 Hu, BQuinet, EUnwalla, RCollini, MJetter, JDooley, RAndraka, DNogle, LSavio, DHalpern, AGoos-Nilsson, AWilhelmsson, ANambi, PWrobel, J Carboxylic acid based quinolines as liver X receptor modulators that have LXRbeta receptor binding selectivity. Bioorg Med Chem Lett 18:54-9 (2008)  
Target
Name:
Oxysterols receptor LXR-alpha
Synonyms:
LXRA Liver X receptor alpha Liver X receptor alpha (NR1H3) NR1H3 Nuclear orphan receptor LXR-alpha | Nuclear receptor subfamily 1 group H member 3
Type:
Enzyme Catalytic Domain
Mol. Mass.:
50403.85
Organism:
Homo sapiens (Human)
Description:
Q13133
Residue:
447
  
Inhibitor
Name:
BDBM50227155
Synonyms:
2-{4-[3-(3-benzoyl-8-trifluoromethyl-quinolin-5-yl)-phenoxymethyl]-phenyl}-3-biphenyl-4-yl-propionic acid | CHEMBL254335
Type:
Small organic molecule
Emp. Form.:
C45H32F3NO4
Mol. Mass.:
707.7351
SMILES:
OC(=O)C(Cc1ccc(cc1)-c1ccccc1)c1ccc(COc2cccc(c2)-c2ccc(c3ncc(cc23)C(=O)c2ccccc2)C(F)(F)F)cc1
: