Target
Tyrosine-protein phosphatase non-receptor type 2
Ligand
BDBM50228019
Substrate
Meas. Tech.
ChEMBL_461677 (CHEMBL927698)
IC50
160±n/a nM
Citation
 Douty, BWayland, BAla, PJBower, MJPruitt, JBostrom, LWei, MKlabe, RGonneville, LWynn, RBurn, TCLiu, PCCombs, APYue, EW Isothiazolidinone inhibitors of PTP1B containing imidazoles and imidazolines. Bioorg Med Chem Lett 18:66-71 (2008)  
Target
Name:
Tyrosine-protein phosphatase non-receptor type 2
Synonyms:
PTN2_HUMAN PTPT T-cell protein-tyrosine phosphatase TCPTP Tyrosine-protein phosphatase non-receptor type 2 (TC-PTP)
Type:
Protein
Mol. Mass.:
48481.80
Organism:
Homo sapiens (Human)
Description:
P17706
Residue:
415
  
Inhibitor
Name:
BDBM50228019
Synonyms:
CHEMBL403681 | N-{1-[5-(4-phenyl-butyl)-1H-imidazol-2-yl]-2-[4-(1,1,3-trioxo-1lambda6-isothiazolidin-5-yl)-phenyl]-ethyl}-3-trifluoromethyl-benzenesulfonamide
Type:
Small organic molecule
Emp. Form.:
C31H31F3N4O5S2
Mol. Mass.:
660.727
SMILES:
FC(F)(F)c1cccc(c1)S(=O)(=O)NC(Cc1ccc(cc1)C1CC(=O)NS1(=O)=O)c1ncc(CCCCc2ccccc2)[nH]1
: