Target
Cannabinoid receptor 2
Ligand
BDBM50228072
Substrate
Meas. Tech.
ChEMBL_452383 (CHEMBL901623)
Ki
0.82±n/a nM
Citation
 Khanolkar, ADLu, DIbrahim, MDuclos, RIThakur, GAMalan, TPPorreca, FVeerappan, VTian, XGeorge, CParrish, DAPapahatjis, DPMakriyannis, A Cannabilactones: a novel class of CB2 selective agonists with peripheral analgesic activity. J Med Chem 50:6493-500 (2007)  
Target
Name:
Cannabinoid receptor 2
Synonyms:
CANNABINOID CB2 CB2 Cannabinoid CB2 receptor Cannabinoid receptor 2 mCB2
Type:
Enzyme Catalytic Domain
Mol. Mass.:
38220.43
Organism:
MOUSE
Description:
P47936
Residue:
347
  
Inhibitor
Name:
BDBM50228072
Synonyms:
1,9-dihydroxy-3-(1',1'-dimethylheptyl)-6H-benzo[c]chromene-6-one AM-1714 | CHEMBL429797
Type:
Small organic molecule
Emp. Form.:
C22H26O4
Mol. Mass.:
354.4394
SMILES:
CCCCCCC(C)(C)c1cc(O)c2c(c1)oc(=O)c1ccc(O)cc21
: