Target
Progesterone receptor
Ligand
BDBM50228078
Substrate
Meas. Tech.
ChEMBL_452395 (CHEMBL902631)
Ki
162.9±n/a nM
Citation
 Bell, MGGernert, DLGrese, TABelvo, MDBorromeo, PSKelley, SAKennedy, JHKolis, SPLander, PARichey, RSharp, VSStephenson, GAWilliams, JDYu, HZimmerman, KMSteinberg, MIJadhav, PK (S)-N-{3-[1-cyclopropyl-1-(2,4-difluoro-phenyl)-ethyl]-1H-indol-7-yl}-methanesulfonamide: a potent, nonsteroidal, functional antagonist of the mineralocorticoid receptor. J Med Chem 50:6443-5 (2007)  
Target
Name:
Progesterone receptor
Synonyms:
NR3C3 PGR PRGR_HUMAN | progesterone
Type:
Protein
Mol. Mass.:
98979.52
Organism:
Homo sapiens (Human)
Description:
P06401
Residue:
933
  
Inhibitor
Name:
BDBM50228078
Synonyms:
(S)-N-(3-(1-cyclopropyl-1-(2,4-difluorophenyl)ethyl)-1H-indol-7-yl)methanesulfonamide | CHEMBL235206
Type:
Small organic molecule
Emp. Form.:
C20H20F2N2O2S
Mol. Mass.:
390.447
SMILES:
C[C@](C1CC1)(c1c[nH]c2c(NS(C)(=O)=O)cccc12)c1ccc(F)cc1F
: