Target
Coagulation factor X
Ligand
BDBM50228949
Substrate
Meas. Tech.
ChEMBL_461718 (CHEMBL928849)
Ki
4.4±n/a nM
Citation
 Young, RJBorthwick, ADBrown, DBurns-Kurtis, CLCampbell, MChan, CCharbaut, MChung, CWConvery, MAKelly, HAPaul King, NKleanthous, SMason, AMPateman, AJPatikis, ANPinto, ILPollard, DRSenger, SShah, GPToomey, JRWatson, NSWeston, HE Structure and property based design of factor Xa inhibitors: pyrrolidin-2-ones with biaryl P4 motifs. Bioorg Med Chem Lett 18:23-7 (2008)  
Target
Name:
Coagulation factor X
Synonyms:
Activated coagulation factor X (FXa) Coagulation factor X precursor F10 Factor X heavy chain Factor Xa Stuart-Prower factor
Type:
Enzyme
Mol. Mass.:
54726.60
Organism:
Homo sapiens (Human)
Description:
Residue:
488
  
Inhibitor
Name:
BDBM50228949
Synonyms:
6-chloro-N-(1-(2-fluoro-4-(1H-imidazol-1-yl)phenyl)-2-oxopyrrolidin-3-yl)naphthalene-2-sulfonamide | CHEMBL402077
Type:
Small organic molecule
Emp. Form.:
C23H18ClFN4O3S
Mol. Mass.:
484.93
SMILES:
Fc1cc(ccc1N1CCC(NS(=O)(=O)c2ccc3cc(Cl)ccc3c2)C1=O)-n1ccnc1
: